Reaction Details
TargetSigma non-opioid intracellular receptor 1
LigandBDBM50145021
Substrate/Competitorn/a
Meas. Tech.ChEMBL_1694031 (CHEMBL4044921)
Ki 0.036000±n/a nM
Citation Fanter, LMüller, CSchepmann, DBracher, FWünsch, B Chiral-pool synthesis of 1,2,4-trisubstituted 1,4-diazepanes as novel? Bioorg Med Chem25:4778-4799 (2017) 
 
Sigma non-opioid intracellular receptor 1
Name:Sigma non-opioid intracellular receptor 1
Type:Protein
Mol. Mass.:25307.17
Organism:Cavia porcellus (Guinea pig)
Description:Q60492
Residue:223
BDBM50145021
NameBDBM50145021
Synonyms:1-Cyclohexyl-4-[4-(1,2,3,4-tetrahydro-naphthalen-1-yl)-butyl]-piperazine | CHEMBL76758
TypeSmall organic molecule
Emp. Form.C24H38N2
Mol. Mass.354.5719
SMILESC(CCN1CCN(CC1)C1CCCCC1)CC1CCCc2ccccc12