Reaction Details
TargetSigma non-opioid intracellular receptor 1
LigandBDBM50260583
Substrate/Competitorn/a
Meas. Tech.ChEBML_1694030
Ki 0.770000±n/a nM
Citation Fanter, LMüller, CSchepmann, DBracher, FWünsch, B Chiral-pool synthesis of 1,2,4-trisubstituted 1,4-diazepanes as novel? Bioorg Med Chem25:4778-4799 (2017) 
 
Sigma non-opioid intracellular receptor 1
Name:Sigma non-opioid intracellular receptor 1
Type:Protein
Mol. Mass.:25307.17
Organism:Cavia porcellus (Guinea pig)
Description:Q60492
Residue:223
BDBM50260583
NameBDBM50260583
Synonyms:CHEMBL4094304
TypeSmall organic molecule
Emp. Form.C23H32N2
Mol. Mass.336.5136
SMILESC[C@H]1CN(CCCCc2ccccc2)CCCN1Cc1ccccc1