Reaction Details
TargetDihydrofolate reductase
LigandBDBM18512
Substrate/Competitorn/a
Meas. Tech.ChEBML_1694634
IC50 101±n/a nM
Citation Thakkar, SSThakor, PRay, ADoshi, HThakkar, VR Benzothiazole analogues: Synthesis, characterization, MO calculations with PM6 and DFT, in silico studies and in vitro antimalarial as DHFR inhibitors and antimicrobial activities. Bioorg Med Chem25:5396-5406 (2017) 
 
Dihydrofolate reductase
Name:Dihydrofolate reductase
Type:Enzyme
Mol. Mass.:21603.71
Organism:Bos taurus (Cattle)
Description:P00376
Residue:187
BDBM18512
NameBDBM18512
Synonyms:5-(4-chlorophenyl)-6-ethylpyrimidine-2,4-diamine Pyrimethamine (Pyr) cid_4993
TypeSmall organic molecule
Emp. Form.C12H13ClN4
Mol. Mass.248.711
SMILESCCc1nc(N)nc(N)c1-c1ccc(Cl)cc1