Reaction Details
TargetSigma non-opioid intracellular receptor 1
LigandBDBM50260843
Substrate/Competitorn/a
Meas. Tech.ChEBML_1694656
Ki 48±n/a nM
Citation Rath, SSchepmann, DWünsch, B Replacement of benzylic hydroxy group by vinyl or hydroxymethyl moiety at the 3-benzazepine scaffold retaining GluN2B affinity. Bioorg Med Chem25:5365-5372 (2017) 
 
Sigma non-opioid intracellular receptor 1
Name:Sigma non-opioid intracellular receptor 1
Type:Protein
Mol. Mass.:25307.17
Organism:Cavia porcellus (Guinea pig)
Description:Q60492
Residue:223
BDBM50260843
NameBDBM50260843
Synonyms:CHEMBL4075349
TypeSmall organic molecule
Emp. Form.C22H27NO
Mol. Mass.321.4559
SMILESOc1ccc2CCN(CCCCc3ccccc3)CC(C=C)c2c1