Reaction Details
TargetBeta-galactosidase
LigandBDBM50261418
Substrate/Competitorn/a
Meas. Tech.ChEMBL_1696005 (CHEMBL4046895)
IC50 43±n/a nM
Citation Pickens, JBWang, FStriegler, S Picomolar inhibition of?-galactosidase (bovine liver) attributed to loop closure. Bioorg Med Chem25:5194-5202 (2017) 
 
Beta-galactosidase
Name:Beta-galactosidase
Type:Protein
Mol. Mass.:73420.88
Organism:Bos taurus (Bovine)
Description:n/a
Residue:653
BDBM50261418
NameBDBM50261418
Synonyms:CHEMBL4091969
TypeSmall organic molecule
Emp. Form.C17H34N2O4
Mol. Mass.330.4629
SMILESCCCCCCCCCCCNC1=N[C@H](CO)[C@H](O)[C@H](O)[C@H]1O