Reaction Details
TargetBeta-galactosidase
LigandBDBM50261420
Substrate/Competitorn/a
Meas. Tech.ChEMBL_1696005 (CHEMBL4046895)
IC50 1030±n/a nM
Citation Pickens, JBWang, FStriegler, S Picomolar inhibition of?-galactosidase (bovine liver) attributed to loop closure. Bioorg Med Chem25:5194-5202 (2017) 
 
Beta-galactosidase
Name:Beta-galactosidase
Type:Protein
Mol. Mass.:73420.88
Organism:Bos taurus (Bovine)
Description:n/a
Residue:653
BDBM50261420
NameBDBM50261420
Synonyms:CHEMBL3359673
TypeSmall organic molecule
Emp. Form.C9H18N2O4
Mol. Mass.218.2502
SMILESCCC\N=C1/N[C@H](CO)[C@H](O)[C@H](O)[C@H]1O