Reaction Details
TargetBeta-galactosidase
LigandBDBM50261423
Substrate/Competitorn/a
Meas. Tech.ChEMBL_1696005 (CHEMBL4046895)
IC50 15±n/a nM
Citation Pickens, JBWang, FStriegler, S Picomolar inhibition of?-galactosidase (bovine liver) attributed to loop closure. Bioorg Med Chem25:5194-5202 (2017) 
 
Beta-galactosidase
Name:Beta-galactosidase
Type:Protein
Mol. Mass.:73420.88
Organism:Bos taurus (Bovine)
Description:n/a
Residue:653
BDBM50261423
NameBDBM50261423
Synonyms:CHEMBL3359123
TypeSmall organic molecule
Emp. Form.C14H17F3N2O4
Mol. Mass.334.291
SMILESOC[C@H]1N\C(=N/Cc2ccc(cc2)C(F)(F)F)[C@H](O)[C@@H](O)[C@H]1O