Reaction Details
TargetBeta-galactosidase
LigandBDBM50261435
Substrate/Competitorn/a
Meas. Tech.ChEMBL_1696005 (CHEMBL4046895)
IC50 412±n/a nM
Citation Pickens, JBWang, FStriegler, S Picomolar inhibition of?-galactosidase (bovine liver) attributed to loop closure. Bioorg Med Chem25:5194-5202 (2017) 
 
Beta-galactosidase
Name:Beta-galactosidase
Type:Protein
Mol. Mass.:73420.88
Organism:Bos taurus (Bovine)
Description:n/a
Residue:653
BDBM50261435
NameBDBM50261435
Synonyms:CHEMBL3359666
TypeSmall organic molecule
Emp. Form.C17H26N2O4
Mol. Mass.322.3993
SMILESCC(C)(C)c1ccc(C\N=C2/N[C@H](CO)[C@H](O)[C@H](O)[C@H]2O)cc1