Reaction Details
TargetBeta-galactosidase
LigandBDBM50140062
Substrate/Competitorn/a
Meas. Tech.ChEMBL_1696005 (CHEMBL4046895)
IC50 58±n/a nM
Citation Pickens, JBWang, FStriegler, S Picomolar inhibition of?-galactosidase (bovine liver) attributed to loop closure. Bioorg Med Chem25:5194-5202 (2017) 
 
Beta-galactosidase
Name:Beta-galactosidase
Type:Protein
Mol. Mass.:73420.88
Organism:Bos taurus (Bovine)
Description:n/a
Residue:653
BDBM50140062
NameBDBM50140062
Synonyms:CHEMBL3359672
TypeSmall organic molecule
Emp. Form.C14H20N2O4
Mol. Mass.280.3196
SMILESCc1ccc(C\N=C2/N[C@H](CO)[C@H](O)[C@H](O)[C@H]2O)cc1