Reaction Details
TargetBeta-galactosidase
LigandBDBM50261422
Substrate/Competitorn/a
Meas. Tech.ChEMBL_1696005 (CHEMBL4046895)
IC50>1400±n/a nM
Citation Pickens, JBWang, FStriegler, S Picomolar inhibition of?-galactosidase (bovine liver) attributed to loop closure. Bioorg Med Chem25:5194-5202 (2017) 
 
Beta-galactosidase
Name:Beta-galactosidase
Type:Protein
Mol. Mass.:73420.88
Organism:Bos taurus (Bovine)
Description:n/a
Residue:653
BDBM50261422
NameBDBM50261422
Synonyms:CHEMBL3359680
TypeSmall organic molecule
Emp. Form.C10H18N2O4
Mol. Mass.230.2609
SMILESOC[C@H]1N\C(=N/CC2CC2)[C@H](O)[C@@H](O)[C@H]1O