Reaction Details
TargetBeta-galactosidase
LigandBDBM50261415
Substrate/Competitorn/a
Meas. Tech.ChEBML_1696006
Ki 2.3±n/a nM
Citation Pickens, JBWang, FStriegler, S Picomolar inhibition of?-galactosidase (bovine liver) attributed to loop closure. Bioorg Med Chem25:5194-5202 (2017) 
 
Beta-galactosidase
Name:Beta-galactosidase
Type:Protein
Mol. Mass.:73420.88
Organism:Bos taurus (Bovine)
Description:n/a
Residue:653
BDBM50261415
NameBDBM50261415
Synonyms:CHEMBL3359679
TypeSmall organic molecule
Emp. Form.C12H22N2O4
Mol. Mass.258.3141
SMILESOC[C@H]1N\C(=N/C2CCCCC2)[C@H](O)[C@@H](O)[C@H]1O