Reaction Details
TargetBeta-galactosidase
LigandBDBM50261442
Substrate/Competitorn/a
Meas. Tech.ChEMBL_1696005 (CHEMBL4046895)
IC50 45±n/a nM
Citation Pickens, JBWang, FStriegler, S Picomolar inhibition of?-galactosidase (bovine liver) attributed to loop closure. Bioorg Med Chem25:5194-5202 (2017) 
 
Beta-galactosidase
Name:Beta-galactosidase
Type:Protein
Mol. Mass.:73420.88
Organism:Bos taurus (Bovine)
Description:n/a
Residue:653
BDBM50261442
NameBDBM50261442
Synonyms:CHEMBL3359682
TypeSmall organic molecule
Emp. Form.C14H26N2O4
Mol. Mass.286.3672
SMILESOC[C@H]1N\C(=N/CC2CCCCCC2)[C@H](O)[C@@H](O)[C@H]1O