Reaction Details
TargetBeta-galactosidase
LigandBDBM50261438
Substrate/Competitorn/a
Meas. Tech.ChEMBL_1696005 (CHEMBL4046895)
IC50 26±n/a nM
Citation Pickens, JBWang, FStriegler, S Picomolar inhibition of?-galactosidase (bovine liver) attributed to loop closure. Bioorg Med Chem25:5194-5202 (2017) 
 
Beta-galactosidase
Name:Beta-galactosidase
Type:Protein
Mol. Mass.:73420.88
Organism:Bos taurus (Bovine)
Description:n/a
Residue:653
BDBM50261438
NameBDBM50261438
Synonyms:CHEMBL3359122
TypeSmall organic molecule
Emp. Form.C14H20N2O5
Mol. Mass.296.319
SMILESCOc1ccc(C\N=C2/N[C@H](CO)[C@H](O)[C@H](O)[C@H]2O)cc1