Reaction Details
TargetBeta-galactosidase
LigandBDBM50261417
Substrate/Competitorn/a
Meas. Tech.ChEMBL_1696005 (CHEMBL4046895)
IC50 41±n/a nM
Citation Pickens, JBWang, FStriegler, S Picomolar inhibition of?-galactosidase (bovine liver) attributed to loop closure. Bioorg Med Chem25:5194-5202 (2017) 
 
Beta-galactosidase
Name:Beta-galactosidase
Type:Protein
Mol. Mass.:73420.88
Organism:Bos taurus (Bovine)
Description:n/a
Residue:653
BDBM50261417
NameBDBM50261417
Synonyms:CHEMBL3359677
TypeSmall organic molecule
Emp. Form.C15H22N2O4
Mol. Mass.294.3462
SMILESOC[C@H]1N\C(=N/CCCc2ccccc2)[C@H](O)[C@@H](O)[C@H]1O