Reaction Details
TargetD(2) dopamine receptor
LigandBDBM50261537
Substrate/Competitorn/a
Meas. Tech.ChEMBL_1696084 (CHEMBL4046974)
Ki 0.730000±n/a nM
Citation Männel, BHübner, HMöller, DGmeiner, P ?-Arrestin biased dopamine D2 receptor partial agonists: Synthesis and pharmacological evaluation. Bioorg Med Chem25:5613-5628 (2017) 
 
D(2) dopamine receptor
Name:D(2) dopamine receptor
Type:Cell-surface receptors
Mol. Mass.:50647.10
Organism:Homo sapiens (Human)
Description:P14416
Residue:443
BDBM50261537
NameBDBM50261537
Synonyms:CHEMBL4079375
TypeSmall organic molecule
Emp. Form.C24H27N5O5
Mol. Mass.465.5017
SMILESOc1ccc(N2CCN(CCCCOc3ccn4ncc(C=O)c4c3)CC2)c2OCC(=O)Nc12