Reaction Details
TargetD(2) dopamine receptor
LigandBDBM50261548
Substrate/Competitorn/a
Meas. Tech.ChEMBL_1696093 (CHEMBL4046983)
EC50 980±n/a nM
Citation Männel, BHübner, HMöller, DGmeiner, P ?-Arrestin biased dopamine D2 receptor partial agonists: Synthesis and pharmacological evaluation. Bioorg Med Chem25:5613-5628 (2017) 
 
D(2) dopamine receptor
Name:D(2) dopamine receptor
Type:Cell-surface receptors
Mol. Mass.:50647.10
Organism:Homo sapiens (Human)
Description:P14416
Residue:443
BDBM50261548
NameBDBM50261548
Synonyms:CHEMBL4087217
TypeSmall organic molecule
Emp. Form.C15H21N3O3
Mol. Mass.291.3455
SMILESCCCN1CCN(CC1)c1ccc(O)c2NC(=O)COc12