Reaction Details
TargetD(2) dopamine receptor
LigandBDBM50010592
Substrate/Competitorn/a
Meas. Tech.ChEBML_58691
IC50 27±n/a nM
Citation Davis, DAde Paulis, TJanowsky, ASmith, HE Chloro-substituted, sterically hindered 5,11-dicarbo analogues of clozapine as potential chiral antipsychotic agents. J Med Chem33:809-14 (1990) D(2) dopamine receptor
Name:D(2) dopamine receptor
Type:G Protein-Coupled Receptor (GPCR)
Mol. Mass.:50931.60
Organism:Rattus norvegicus (rat)
Description:P61169
Residue:444
BDBM50010592
NameBDBM50010592
Synonyms:1-(8-Chloro-5-methylene-5H-dibenzo[a,d]cyclohepten-10-yl)-4-methyl-piperazine | CHEMBL72162
TypeSmall organic molecule
Emp. Form.C21H21ClN2
Mol. Mass.336.858
SMILESCN1CCN(CC1)C1=Cc2ccccc2C(=C)c2ccc(Cl)cc12