Reaction Details
TargetD(1A) dopamine receptor
LigandBDBM50010596
Substrate/Competitorn/a
Meas. Tech.ChEBML_58174
IC50 133±n/a nM
Citation Davis, DAde Paulis, TJanowsky, ASmith, HE Chloro-substituted, sterically hindered 5,11-dicarbo analogues of clozapine as potential chiral antipsychotic agents. J Med Chem33:809-14 (1990) D(1A) dopamine receptor
Name:D(1A) dopamine receptor
Type:Enzyme Catalytic Domain
Mol. Mass.:49429.75
Organism:RAT
Description:P18901
Residue:446
BDBM50010596
NameBDBM50010596
Synonyms:1-(8-Chloro-5-isopropylidene-5H-dibenzo[a,d]cyclohepten-10-yl)-4-methyl-piperazine | CHEMBL73082
TypeSmall organic molecule
Emp. Form.C23H25ClN2
Mol. Mass.364.911
SMILES[#6]-[#7]-1-[#6]-[#6]-[#7](-[#6]-[#6]-1)-[#6]-1=[#6]-c2ccccc2\[#6](=[#6](\[#6])-[#6])-c2ccc(Cl)cc-12