Reaction Details
TargetD(1A) dopamine receptor
LigandBDBM50010597
Substrate/Competitorn/a
Meas. Tech.ChEBML_58174
IC50 540±n/a nM
Citation Davis, DAde Paulis, TJanowsky, ASmith, HE Chloro-substituted, sterically hindered 5,11-dicarbo analogues of clozapine as potential chiral antipsychotic agents. J Med Chem33:809-14 (1990) D(1A) dopamine receptor
Name:D(1A) dopamine receptor
Type:Enzyme Catalytic Domain
Mol. Mass.:49429.75
Organism:RAT
Description:P18901
Residue:446
BDBM50010597
NameBDBM50010597
Synonyms:1-(5-Isopropylidene-5H-dibenzo[a,d]cyclohepten-10-yl)-4-methyl-piperazine | CHEMBL88870
TypeSmall organic molecule
Emp. Form.C23H26N2
Mol. Mass.330.4659
SMILES[#6]-[#7]-1-[#6]-[#6]-[#7](-[#6]-[#6]-1)-[#6]-1=[#6]-c2ccccc2\[#6](=[#6](\[#6])-[#6])-c2ccccc-12