Reaction Details
TargetD(1A) dopamine receptor
LigandBDBM50010598
Substrate/Competitorn/a
Meas. Tech.ChEBML_58174
IC50 21±n/a nM
Citation Davis, DAde Paulis, TJanowsky, ASmith, HE Chloro-substituted, sterically hindered 5,11-dicarbo analogues of clozapine as potential chiral antipsychotic agents. J Med Chem33:809-14 (1990) D(1A) dopamine receptor
Name:D(1A) dopamine receptor
Type:Enzyme Catalytic Domain
Mol. Mass.:49429.75
Organism:RAT
Description:P18901
Residue:446
BDBM50010598
NameBDBM50010598
Synonyms:1-Methyl-4-(5-methylene-5H-dibenzo[a,d]cyclohepten-10-yl)-piperazine | CHEMBL91310
TypeSmall organic molecule
Emp. Form.C21H22N2
Mol. Mass.302.4128
SMILESCN1CCN(CC1)C1=Cc2ccccc2C(=C)c2ccccc12