Reaction Details
TargetD(1A) dopamine receptor
LigandBDBM50010594
Substrate/Competitorn/a
Meas. Tech.ChEBML_58174
IC50 63±n/a nM
Citation Davis, DAde Paulis, TJanowsky, ASmith, HE Chloro-substituted, sterically hindered 5,11-dicarbo analogues of clozapine as potential chiral antipsychotic agents. J Med Chem33:809-14 (1990) D(1A) dopamine receptor
Name:D(1A) dopamine receptor
Type:Enzyme Catalytic Domain
Mol. Mass.:49429.75
Organism:RAT
Description:P18901
Residue:446
BDBM50010594
NameBDBM50010594
Synonyms:2-Chloro-11-(4-methyl-piperazin-1-yl)-5H-dibenzo[b,e][1,4]diazepine CHEMBL415300 | ISOCLOZAPINE
TypeSmall organic molecule
Emp. Form.C18H19ClN4
Mol. Mass.326.823
SMILESCN1CCN(CC1)C1=Nc2ccccc2Nc2ccc(Cl)cc12