Reaction Details
TargetD(2) dopamine receptor
LigandBDBM50010597
Substrate/Competitorn/a
Meas. Tech.ChEBML_58691
IC50 4750±n/a nM
Citation Davis, DAde Paulis, TJanowsky, ASmith, HE Chloro-substituted, sterically hindered 5,11-dicarbo analogues of clozapine as potential chiral antipsychotic agents. J Med Chem33:809-14 (1990) D(2) dopamine receptor
Name:D(2) dopamine receptor
Type:G Protein-Coupled Receptor (GPCR)
Mol. Mass.:50931.60
Organism:Rattus norvegicus (rat)
Description:P61169
Residue:444
BDBM50010597
NameBDBM50010597
Synonyms:1-(5-Isopropylidene-5H-dibenzo[a,d]cyclohepten-10-yl)-4-methyl-piperazine | CHEMBL88870
TypeSmall organic molecule
Emp. Form.C23H26N2
Mol. Mass.330.4659
SMILES[#6]-[#7]-1-[#6]-[#6]-[#7](-[#6]-[#6]-1)-[#6]-1=[#6]-c2ccccc2\[#6](=[#6](\[#6])-[#6])-c2ccccc-12