Reaction Details
TargetD(2) dopamine receptor
LigandBDBM50010692
Substrate/Competitorn/a
Meas. Tech.ChEBML_62260
Ki 0.170000±n/a nM
Citation Gao, YGBaldessarini, RJKula, NSNeumeyer, JL Synthesis and dopamine receptor affinities of enantiomers of 2-substituted apomorphines and their N-n-propyl analogues. J Med Chem33:1800-5 (1990) D(2) dopamine receptor
Name:D(2) dopamine receptor
Type:G Protein-Coupled Receptor (GPCR)
Mol. Mass.:50931.60
Organism:Rattus norvegicus (rat)
Description:P61169
Residue:444
BDBM50010692
NameBDBM50010692
Synonyms:(R)-(-)-2-methoxy-N-npropylnorapomorphine 2-Methoxy-6-propyl-5,6,6a,7-tetrahydro-4H-dibenzo[de,g]quinoline-10,11-diol | CHEMBL53294
TypeSmall organic molecule
Emp. Form.C20H23NO3
Mol. Mass.325.4015
SMILESCCCN1CCc2cc(OC)cc-3c2[C@H]1Cc1ccc(O)c(O)c-31