Reaction Details
TargetFolylpolyglutamate synthase, mitochondrial
LigandBDBM50010931
Substrate/Competitorn/a
Meas. Tech.ChEBML_68517
IC50>50000±n/a nM
Citation Abraham, AMcGuire, JJGalivan, JNimec, ZKisliuk, RLGaumont, YNair, MG Folate analogues. 34. Synthesis and antitumor activity of non-polyglutamylatable inhibitors of dihydrofolate reductase. J Med Chem34:222-7 (1991) Folylpolyglutamate synthase, mitochondrial
Name:Folylpolyglutamate synthase, mitochondrial
Type:PROTEIN
Mol. Mass.:64621.95
Organism:Homo sapiens (Human)
Description:ChEMBL_68676
Residue:587
BDBM50010931
NameBDBM50010931
Synonyms:2-{4-[2-(2,4-Diamino-pteridin-6-yl)-ethyl]-benzoylamino}-3-hydroxy-pentanedioic acid | CHEMBL73267
TypeSmall organic molecule
Emp. Form.C20H21N7O6
Mol. Mass.455.424
SMILESNc1nc(N)c2nc(CCc3ccc(cc3)C(=O)NC(C(O)CC(O)=O)C(O)=O)cnc2n1