Reaction Details
TargetMelanocortin receptor 3
LigandBDBM50017181
Substrate/Competitorn/a
Meas. Tech.ChEBML_1697898
EC50 0.330000±n/a nM
Citation Ericson, MDSingh, ATala, SRHaslach, EMDirain, MLSSchaub, JWFlores, VEick, NLensing, CJFreeman, KTSmeester, BAAdank, DNWilber, SLSpeth, RHaskell-Luevano, C Human?-Defensin 1 and?-Defensin 3 (Mouse Ortholog mBD14) Function as Full Endogenous Agonists at Select Melanocortin Receptors. J Med Chem61:3738-3744 (2018) 
 
Melanocortin receptor 3
Name:Melanocortin receptor 3
Type:PROTEIN
Mol. Mass.:35808.24
Organism:Mus musculus
Description:ChEMBL_1498848
Residue:323
BDBM50017181
NameBDBM50017181
Synonyms:CHEMBL441738
TypeSmall organic molecule
Emp. Form.C78H111N21O19
Mol. Mass.1646.8452
SMILESCCCC[C@H](NC(=O)[C@H](CO)NC(=O)[C@H](Cc1ccc(O)cc1)NC(=O)[C@H](CO)NC(C)=O)C(=O)N[C@@H](CCC(O)=O)C(=O)N[C@@H](Cc1cnc[nH]1)C(=O)N[C@H](Cc1ccccc1)C(=O)N[C@@H](CCCNC(N)=N)C(=O)N[C@@H](Cc1c[nH]c2ccccc12)C(=O)NCC(=O)N[C@@H](CCCCN)C(=O)N1CCC[C@H]1C(=O)N[C@@H](C(C)C)C(N)=O