Reaction Details
TargetHistone deacetylase 6
LigandBDBM50263483
Substrate/Competitorn/a
Meas. Tech.ChEBML_1697937
Ki 0.080000±n/a nM
Citation Sellmer, AStangl, HBeyer, MGrünstein, ELeonhardt, MPongratz, HEichhorn, EElz, SStriegl, BJenei-Lanzl, ZDove, SStraub, RHKrämer, OHMahboobi, S Marbostat-100 Defines a New Class of Potent and Selective Antiinflammatory and Antirheumatic Histone Deacetylase 6 Inhibitors. J Med Chem61:3454-3477 (2018) 
 
Histone deacetylase 6
Name:Histone deacetylase 6
Type:Chromatin regulator; hydrolase; repressor
Mol. Mass.:131381.51
Organism:Homo sapiens (Human)
Description:Q9UBN7
Residue:1215
BDBM50263483
NameBDBM50263483
Synonyms:CHEMBL4082520
TypeSmall organic molecule
Emp. Form.C29H26N4O5
Mol. Mass.510.5405
SMILESCN1C(=O)C2CN(Cc3c2c2cc(OCc4ccccc4)ccc2n3Cc2ccc(cc2)C(=O)NO)C1=O