Reaction Details
TargetMuscarinic acetylcholine receptor M1
LigandBDBM50263495
Substrate/Competitorn/a
Meas. Tech.ChEMBL_1698020 (CHEMBL4048910)
IC50 1202±n/a nM
Citation Del Bello, FBonifazi, AGiorgioni, GCifani, CMicioni Di Bonaventura, MVPetrelli, RPiergentili, AFontana, SMammoli, VYano, HMatucci, RVistoli, GQuaglia, W 1-[3-(4-Butylpiperidin-1-yl)propyl]-1,2,3,4-tetrahydroquinolin-2-one (77-LH-28-1) as a Model for the Rational Design of a Novel Class of Brain Penetrant Ligands with High Affinity and Selectivity for Dopamine D J Med Chem61:3712-3725 (2018) 
 
Muscarinic acetylcholine receptor M1
Name:Muscarinic acetylcholine receptor M1
Type:Protein
Mol. Mass.:51442.54
Organism:Homo sapiens (Human)
Description:P11229
Residue:460
BDBM50263495
NameBDBM50263495
Synonyms:CHEMBL4072818
TypeSmall organic molecule
Emp. Form.C24H30N2O
Mol. Mass.362.5078
SMILESO=C1CCc2ccccc2N1CCCN1CCC(Cc2ccccc2)CC1