Reaction Details
TargetMelatonin receptor type 1B
LigandBDBM50263699
Substrate/Competitorn/a
Meas. Tech.ChEBML_1698236
Ki 0.230000±n/a nM
Citation Rivara, SScalvini, LLodola, AMor, MCaignard, DHDelagrange, PCollina, SLucini, VScaglione, FFuriassi, LMari, MLucarini, SBedini, ASpadoni, G Tetrahydroquinoline Ring as a Versatile Bioisostere of Tetralin for Melatonin Receptor Ligands. J Med Chem61:3726-3737 (2018) 
 
Melatonin receptor type 1B
Name:Melatonin receptor type 1B
Type:Enzyme
Mol. Mass.:40203.54
Organism:Homo sapiens (Human)
Description:P49286
Residue:362
BDBM50263699
NameBDBM50263699
Synonyms:CHEMBL4061850
TypeSmall organic molecule
Emp. Form.C20H23NO
Mol. Mass.293.4027
SMILESCCC(=O)NC[C@@H]1CCc2ccccc2[C@H]1c1ccccc1