Reaction Details
TargetMelatonin receptor type 1B
LigandBDBM50263728
Substrate/Competitorn/a
Meas. Tech.ChEMBL_1698239 (CHEMBL4049129)
EC50 80±n/a nM
Citation Rivara, SScalvini, LLodola, AMor, MCaignard, DHDelagrange, PCollina, SLucini, VScaglione, FFuriassi, LMari, MLucarini, SBedini, ASpadoni, G Tetrahydroquinoline Ring as a Versatile Bioisostere of Tetralin for Melatonin Receptor Ligands. J Med Chem61:3726-3737 (2018) 
 
Melatonin receptor type 1B
Name:Melatonin receptor type 1B
Type:Enzyme
Mol. Mass.:40203.54
Organism:Homo sapiens (Human)
Description:P49286
Residue:362
BDBM50263728
NameBDBM50263728
Synonyms:CHEMBL4102517
TypeSmall organic molecule
Emp. Form.C20H24N2O
Mol. Mass.308.4174
SMILESCC(=O)NCC1CN(CCc2ccccc2)c2ccccc2C1