Reaction Details
TargetMelatonin receptor type 1B
LigandBDBM50263691
Substrate/Competitorn/a
Meas. Tech.ChEMBL_1698236 (CHEMBL4049126)
Ki 2±n/a nM
Citation Rivara, SScalvini, LLodola, AMor, MCaignard, DHDelagrange, PCollina, SLucini, VScaglione, FFuriassi, LMari, MLucarini, SBedini, ASpadoni, G Tetrahydroquinoline Ring as a Versatile Bioisostere of Tetralin for Melatonin Receptor Ligands. J Med Chem61:3726-3737 (2018) 
 
Melatonin receptor type 1B
Name:Melatonin receptor type 1B
Type:Enzyme
Mol. Mass.:40203.54
Organism:Homo sapiens (Human)
Description:P49286
Residue:362
BDBM50263691
NameBDBM50263691
Synonyms:CHEMBL4064813
TypeSmall organic molecule
Emp. Form.C18H20N2O
Mol. Mass.280.3642
SMILESCCC(=O)NC1CN(c2ccccc2)c2ccccc2C1