Reaction Details
TargetEukaryotic initiation factor 4A-I
LigandBDBM50265561
Substrate/Competitorn/a
Meas. Tech.ChEMBL_1700087 (CHEMBL4051069)
IC50>100000±n/a nM
Citation Ito, MTanaka, TCary, DRIwatani-Yoshihara, MKamada, YKawamoto, TAparicio, SNakanishi, AImaeda, Y Discovery of Novel 1,4-Diacylpiperazines as Selective and Cell-Active eIF4A3 Inhibitors. J Med Chem60:3335-3351 (2017) 
 
Eukaryotic initiation factor 4A-I
Name:Eukaryotic initiation factor 4A-I
Type:PROTEIN
Mol. Mass.:46146.87
Organism:Homo sapiens (Human)
Description:ChEMBL_864983
Residue:406
BDBM50265561
NameBDBM50265561
Synonyms:CHEMBL4073833
TypeSmall organic molecule
Emp. Form.C29H23BrClN5O2
Mol. Mass.588.882
SMILESCc1c(cnn1-c1cccc(c1)C#N)C(=O)N1CCN([C@H](C1)c1ccc(Cl)cc1)C(=O)c1ccc(Br)cc1