Reaction Details
TargetGlucocorticoid receptor
LigandBDBM50265730
Substrate/Competitorn/a
Meas. Tech.ChEMBL_1700170 (CHEMBL4051152)
Ki 4.5±n/a nM
Citation Hunt, HJBelanoff, JKWalters, IGourdet, BThomas, JBarton, NUnitt, JPhillips, TSwift, DEaton, E Identification of the Clinical Candidate (R)-(1-(4-Fluorophenyl)-6-((1-methyl-1H-pyrazol-4-yl)sulfonyl)-4,4a,5,6,7,8-hexahydro-1H-pyrazolo[3,4-g]isoquinolin-4a-yl)(4-(trifluoromethyl)pyridin-2-yl)methanone (CORT125134): A Selective Glucocorticoid Receptor (GR) Antagonist. J Med Chem60:3405-3421 (2017) 
 
Glucocorticoid receptor
Name:Glucocorticoid receptor
Type:Enzyme
Mol. Mass.:85656.87
Organism:Homo sapiens (Human)
Description:P04150
Residue:777
BDBM50265730
NameBDBM50265730
Synonyms:CHEMBL4101325
TypeSmall organic molecule
Emp. Form.C30H24FN5O3S
Mol. Mass.553.607
SMILESCc1ccnc(c1)C(=O)[C@@]12CN(CCC1=Cc1c(C2)cnn1-c1ccc(F)cc1)S(=O)(=O)c1cccc(c1)C#N