Reaction Details
TargetGlucocorticoid receptor
LigandBDBM50265766
Substrate/Competitorn/a
Meas. Tech.ChEMBL_1700170 (CHEMBL4051152)
Ki 6.6±n/a nM
Citation Hunt, HJBelanoff, JKWalters, IGourdet, BThomas, JBarton, NUnitt, JPhillips, TSwift, DEaton, E Identification of the Clinical Candidate (R)-(1-(4-Fluorophenyl)-6-((1-methyl-1H-pyrazol-4-yl)sulfonyl)-4,4a,5,6,7,8-hexahydro-1H-pyrazolo[3,4-g]isoquinolin-4a-yl)(4-(trifluoromethyl)pyridin-2-yl)methanone (CORT125134): A Selective Glucocorticoid Receptor (GR) Antagonist. J Med Chem60:3405-3421 (2017) 
 
Glucocorticoid receptor
Name:Glucocorticoid receptor
Type:Enzyme
Mol. Mass.:85656.87
Organism:Homo sapiens (Human)
Description:P04150
Residue:777
BDBM50265766
NameBDBM50265766
Synonyms:CHEMBL4060190
TypeSmall organic molecule
Emp. Form.C27H22F4N6O3S
Mol. Mass.586.561
SMILESCn1ccc(n1)S(=O)(=O)N1CCC2=Cc3c(C[C@@]2(C1)C(=O)c1cc(ccn1)C(F)(F)F)cnn3-c1ccc(F)cc1