Reaction Details
TargetGlucocorticoid receptor
LigandBDBM50265800
Substrate/Competitorn/a
Meas. Tech.ChEMBL_1700169 (CHEMBL4051151)
Ki 0.420000±n/a nM
Citation Hunt, HJBelanoff, JKWalters, IGourdet, BThomas, JBarton, NUnitt, JPhillips, TSwift, DEaton, E Identification of the Clinical Candidate (R)-(1-(4-Fluorophenyl)-6-((1-methyl-1H-pyrazol-4-yl)sulfonyl)-4,4a,5,6,7,8-hexahydro-1H-pyrazolo[3,4-g]isoquinolin-4a-yl)(4-(trifluoromethyl)pyridin-2-yl)methanone (CORT125134): A Selective Glucocorticoid Receptor (GR) Antagonist. J Med Chem60:3405-3421 (2017) 
 
Glucocorticoid receptor
Name:Glucocorticoid receptor
Type:Enzyme
Mol. Mass.:85656.87
Organism:Homo sapiens (Human)
Description:P04150
Residue:777
BDBM50265800
NameBDBM50265800
Synonyms:CHEMBL4104661
TypeSmall organic molecule
Emp. Form.C30H23F5N4O3S
Mol. Mass.614.586
SMILESCc1ccnc(c1)C(=O)[C@@]12CN(CCC1=Cc1c(C2)cnn1-c1ccc(F)cc1)S(=O)(=O)c1ccc(c(F)c1)C(F)(F)F