Reaction Details
TargetAdenosine receptor A1
LigandBDBM21173
Substrate/Competitorn/a
Meas. Tech.ChEMBL_1700308 (CHEMBL4051290)
Ki 2.2±n/a nM
Citation Carbajales, CAzuaje, JOliveira, ALoza, MIBrea, JCadavid, MIMasaguer, CFGarcía-Mera, XGutiérrez-de-Terán, HSotelo, E Enantiospecific Recognition at the A J Med Chem60:3372-3382 (2017) 
 
Adenosine receptor A1
Name:Adenosine receptor A1
Type:G Protein-Coupled Receptor (GPCR)
Mol. Mass.:36520.92
Organism:Homo sapiens (Human)
Description:P30542
Residue:326
BDBM21173
NameBDBM21173
Synonyms:1,3-dipropyl-8-cyclopentylxanthine CHEMBL183 PD116948 | [3H]DPCPX
Typeradiolabeled ligand
Emp. Form.C16H24N4O2
Mol. Mass.304.3874
SMILESCCCn1c2nc([nH]c2c(=O)n(CCC)c1=O)C1CCCC1