Reaction Details
TargetProtein Mdm4
LigandBDBM50266879
Substrate/Competitorn/a
Meas. Tech.ChEMBL_1701466 (CHEMBL4052448)
Ki 14700±n/a nM
Citation Twarda-Clapa, AKrzanik, SKubica, KGuzik, KLabuzek, BNeochoritis, CGKhoury, KKowalska, KCzub, MDubin, GDömling, ASkalniak, LHolak, TA 1,4,5-Trisubstituted Imidazole-Based p53-MDM2/MDMX Antagonists with Aliphatic Linkers for Conjugation with Biological Carriers. J Med Chem60:4234-4244 (2017) 
 
Protein Mdm4
Name:Protein Mdm4
Type:Oncoprotein
Mol. Mass.:54842.04
Organism:Homo sapiens (Human)
Description:The HDMX(1-188) were expressed in Escherichia coli BL21 (DE3) as a GST fusion and purified on glutathione sepharose.
Residue:490
BDBM50266879
NameBDBM50266879
Synonyms:CHEMBL4072678
TypeSmall organic molecule
Emp. Form.C33H23Cl2FN4O3
Mol. Mass.613.465
SMILESOC(=O)c1ccc(CNC(=O)c2[nH]c3cc(Cl)ccc3c2-c2c(ncn2Cc2ccc(Cl)cc2)-c2ccc(F)cc2)cc1