Reaction Details
TargetMethionine aminopeptidase 2
LigandBDBM17847
Substrate/Competitorn/a
Meas. Tech.ChEMBL_1702324 (CHEMBL4053557)
IC50>300000±n/a nM
Citation White, KNTenney, KCrews, P The Bengamides: A Mini-Review of Natural Sources, Analogues, Biological Properties, Biosynthetic Origins, and Future Prospects. J Nat Prod80:740-755 (2017) 
 
Methionine aminopeptidase 2
Name:Methionine aminopeptidase 2
Type:Enzyme
Mol. Mass.:52884.45
Organism:Homo sapiens (Human)
Description:P50579
Residue:478
BDBM17847
NameBDBM17847
Synonyms:CHEMBL327579 tert-butyl N-[2-(1,3-thiazol-2-ylcarbamoyl)pyridin-3-yl]carbamate
TypeSmall organic molecule
Emp. Form.C14H16N4O3S
Mol. Mass.320.367
SMILESCC(C)(C)OC(=O)Nc1cccnc1C(=O)Nc1nccs1