Reaction Details
TargetD(3) dopamine receptor
LigandBDBM50267216
Substrate/Competitorn/a
Meas. Tech.ChEMBL_1702328 (CHEMBL4053561)
Ki 0.450000±n/a nM
Citation Kumar, VMoritz, AEKeck, TMBonifazi, AEllenberger, MPSibley, CDFree, RBShi, LLane, JRSibley, DRNewman, AH Synthesis and Pharmacological Characterization of Novel trans-Cyclopropylmethyl-Linked Bivalent Ligands That Exhibit Selectivity and Allosteric Pharmacology at the Dopamine D J Med Chem60:1478-1494 (2017) 
 
D(3) dopamine receptor
Name:D(3) dopamine receptor
Type:n/a
Mol. Mass.:44243.43
Organism:Homo sapiens (Human)
Description:n/a
Residue:400
BDBM50267216
NameBDBM50267216
Synonyms:CHEMBL4077536
TypeSmall organic molecule
Emp. Form.C24H26Cl2N4O
Mol. Mass.457.395
SMILESClc1cccc(N2CCN(C[C@@H]3C[C@H]3CNC(=O)c3cc4ccccc4[nH]3)CC2)c1Cl