Reaction Details
TargetAromatase
LigandBDBM9460
Substrate/Competitorn/a
Meas. Tech.ChEMBL_84457 (CHEMBL692480)
IC50 13000±n/a nM
Citation Stanek, JAlder, ABellus, DBhatnagar, ASHäusler, ASchieweck, K Synthesis and aromatase inhibitory activity of novel 1-(4-aminophenyl)-3-azabicyclo[3.1.0]hexane- and -[3.1.1]heptane-2,4- diones. J Med Chem34:1329-34 (1991) Aromatase
Name:Aromatase
Type:Enzyme
Mol. Mass.:57888.92
Organism:Homo sapiens (Human)
Description:P11511
Residue:503
BDBM9460
NameBDBM9460
Synonyms:3-(4-aminophenyl)-3-ethyl-piperidine-2,6-dione Aminoglutethimide AG, 4 Cytadren Elipten | aminoglutethimide (AG)
TypeSmall organic molecule
Emp. Form.C13H16N2O2
Mol. Mass.232.2783
SMILESCCC1(CCC(=O)NC1=O)c1ccc(N)cc1