Reaction Details
TargetD(3) dopamine receptor
LigandBDBM50443101
Substrate/Competitorn/a
Meas. Tech.ChEMBL_1703546 (CHEMBL4054779)
Ki 0.270000±n/a nM
Citation Stößel, ABrox, RPurkayastha, NHübner, HHocke, CPrante, OGmeiner, P Development of molecular tools based on the dopamine D Bioorg Med Chem25:3491-3499 (2017) 
 
D(3) dopamine receptor
Name:D(3) dopamine receptor
Type:n/a
Mol. Mass.:44243.43
Organism:Homo sapiens (Human)
Description:n/a
Residue:400
BDBM50443101
NameBDBM50443101
Synonyms:Cariprazine | RGH-188
TypeSmall organic molecule
Emp. Form.C21H32Cl2N4O
Mol. Mass.427.411
SMILESCN(C)C(=O)N[C@H]1CC[C@H](CCN2CCN(CC2)c2cccc(Cl)c2Cl)CC1