Reaction Details
TargetThymidylate synthase
LigandBDBM50012243
Substrate/Competitorn/a
Meas. Tech.ChEBML_208949
Ki 450±n/a nM
Citation Appelt, KBacquet, RJBartlett, CABooth, CLFreer, STFuhry, MAGehring, MRHerrmann, SMHowland, EFJanson, CA Design of enzyme inhibitors using iterative protein crystallographic analysis. J Med Chem34:1925-34 (1991) Thymidylate synthase
Name:Thymidylate synthase
Type:n/a
Mol. Mass.:30487.86
Organism:Escherichia coli
Description:n/a
Residue:264
BDBM50012243
NameBDBM50012243
Synonyms:2-Methyl-6-{[prop-2-ynyl-(3-trifluoromethyl-phenyl)-amino]-methyl}-3H-quinazolin-4-one | CHEMBL301423
TypeSmall organic molecule
Emp. Form.C20H16F3N3O
Mol. Mass.371.3557
SMILESCc1nc2ccc(CN(CC#C)c3cccc(c3)C(F)(F)F)cc2c(=O)[nH]1