Reaction Details
TargetThymidylate synthase
LigandBDBM50011244
Substrate/Competitorn/a
Meas. Tech.ChEBML_209778
Ki 13±n/a nM
Citation Appelt, KBacquet, RJBartlett, CABooth, CLFreer, STFuhry, MAGehring, MRHerrmann, SMHowland, EFJanson, CA Design of enzyme inhibitors using iterative protein crystallographic analysis. J Med Chem34:1925-34 (1991) Thymidylate synthase
Name:Thymidylate synthase
Type:Enzyme
Mol. Mass.:35718.07
Organism:Homo sapiens (Human)
Description:n/a
Residue:313
BDBM50011244
NameBDBM50011244
Synonyms:6-{[(4-Benzenesulfonyl-phenyl)-prop-2-ynyl-amino]-methyl}-2-methyl-3H-quinazolin-4-one | CHEMBL417222
TypeSmall organic molecule
Emp. Form.C25H21N3O3S
Mol. Mass.443.518
SMILESCc1nc2ccc(CN(CC#C)c3ccc(cc3)S(=O)(=O)c3ccccc3)cc2c(=O)[nH]1