Reaction Details
Target5-hydroxytryptamine receptor 1A
LigandBDBM50012983
Substrate/Competitorn/a
Meas. Tech.ChEMBL_1062 (CHEMBL616387)
IC50 18000±n/a nM
Citation Schlecht, MFTsarouhtsis, DLipovac, MNDebler, EA Synthesis and serotonin binding site studies of some conformationally restricted indolylethylamine analogues based on 2-amino-3-(3'-indolyl)bicyclo[2.2.2]octane. J Med Chem33:386-94 (1990) 5-hydroxytryptamine receptor 1A
Name:5-hydroxytryptamine receptor 1A
Type:Enzyme
Mol. Mass.:46192.09
Organism:Mus musculus (Mouse)
Description:Q64264
Residue:421
BDBM50012983
NameBDBM50012983
Synonyms:3-(3-Piperidin-1-yl-bicyclo[2.2.2]oct-5-en-2-yl)-1H-indole | CHEMBL339944
TypeSmall organic molecule
Emp. Form.C21H26N2
Mol. Mass.306.4445
SMILESC1CCN(CC1)C1C2CCC(C=C2)C1c1c[nH]c2ccccc12