Reaction Details
Target5-hydroxytryptamine receptor 1A
LigandBDBM50012984
Substrate/Competitorn/a
Meas. Tech.ChEMBL_1062 (CHEMBL616387)
IC50 358000±n/a nM
Citation Schlecht, MFTsarouhtsis, DLipovac, MNDebler, EA Synthesis and serotonin binding site studies of some conformationally restricted indolylethylamine analogues based on 2-amino-3-(3'-indolyl)bicyclo[2.2.2]octane. J Med Chem33:386-94 (1990) 5-hydroxytryptamine receptor 1A
Name:5-hydroxytryptamine receptor 1A
Type:Enzyme
Mol. Mass.:46192.09
Organism:Mus musculus (Mouse)
Description:Q64264
Residue:421
BDBM50012984
NameBDBM50012984
Synonyms:5-Phenyl-6-piperidin-1-yl-bicyclo[2.2.2]octan-2-one | CHEMBL128954
TypeSmall organic molecule
Emp. Form.C19H25NO
Mol. Mass.283.4079
SMILESO=C1CC2CCC1C(C2c1ccccc1)N1CCCCC1