Reaction Details
TargetPlasminogen
LigandBDBM50012999
Substrate/Competitorn/a
Meas. Tech.ChEMBL_155583 (CHEMBL759958)
IC50>400000±n/a nM
Citation McConnell, RMBarnes, GEHoyng, CFGunn, JM New leupeptin analogues: synthesis and inhibition data. J Med Chem33:86-93 (1990) Plasminogen
Name:Plasminogen
Type:Protein
Mol. Mass.:90541.87
Organism:Rattus norvegicus
Description:Q01177
Residue:812
BDBM50012999
NameBDBM50012999
Synonyms:CHEMBL2371642 | {1-[1-(4-Amino-1-formyl-butylcarbamoyl)-3-methyl-butylcarbamoyl]-3-methyl-butyl}-carbamic acid benzyl ester
TypeSmall organic molecule
Emp. Form.C25H40N4O5
Mol. Mass.476.6089
SMILESCC(C)C[C@H](NC(=O)OCc1ccccc1)C(=O)N[C@@H](CC(C)C)C(=O)N[C@@H](CCCN)C=O