Reaction Details
TargetPlasminogen
LigandBDBM50228472
Substrate/Competitorn/a
Meas. Tech.ChEMBL_155581 (CHEMBL759956)
IC50 10200±n/a nM
Citation McConnell, RMBarnes, GEHoyng, CFGunn, JM New leupeptin analogues: synthesis and inhibition data. J Med Chem33:86-93 (1990) Plasminogen
Name:Plasminogen
Type:Protein
Mol. Mass.:90541.87
Organism:Rattus norvegicus
Description:Q01177
Residue:812
BDBM50228472
NameBDBM50228472
Synonyms:CHEMBL3143648
TypeSmall organic molecule
Emp. Form.C29H40N6O5
Mol. Mass.552.6651
SMILES[#6]-[#6](-[#6])-[#6]-[#6@H](-[#7]-[#6](=O)-[#6@H](-[#6]-c1ccccc1)-[#7]-[#6](=O)-[#8]-[#6]-c1ccccc1)-[#6](=O)-[#7]-[#6@@H](-[#6]-[#6]-[#6]\[#7]=[#6](\[#7])-[#7])-[#6]=O