Reaction Details
TargetPlasminogen
LigandBDBM50013006
Substrate/Competitorn/a
Meas. Tech.ChEBML_155582
IC50 47000±n/a nM
Citation McConnell, RMBarnes, GEHoyng, CFGunn, JM New leupeptin analogues: synthesis and inhibition data. J Med Chem33:86-93 (1990) Plasminogen
Name:Plasminogen
Type:Protein
Mol. Mass.:90541.87
Organism:Rattus norvegicus
Description:Q01177
Residue:812
BDBM50013006
NameBDBM50013006
Synonyms:CHEMBL3143642 | {1-[1-(5-Amino-1-formyl-pentylcarbamoyl)-2-phenyl-ethylcarbamoyl]-3-methyl-butyl}-carbamic acid benzyl ester
TypeSmall organic molecule
Emp. Form.C29H40N4O5
Mol. Mass.524.6517
SMILESCC(C)C[C@H](NC(=O)OCc1ccccc1)C(=O)N[C@@H](Cc1ccccc1)C(=O)N[C@@H](CCCCN)C=O