Reaction Details
TargetSerine protease 1
LigandBDBM50012998
Substrate/Competitorn/a
Meas. Tech.ChEBML_213242
IC50 400000±n/a nM
Citation McConnell, RMBarnes, GEHoyng, CFGunn, JM New leupeptin analogues: synthesis and inhibition data. J Med Chem33:86-93 (1990) Serine protease 1
Name:Serine protease 1
Type:Enzyme
Mol. Mass.:26557.80
Organism:Homo sapiens (Human)
Description:P07477
Residue:247
BDBM50012998
NameBDBM50012998
Synonyms:CHEMBL2371625 | {1-[1-(5-Amino-1-formyl-pentylcarbamoyl)-2-methyl-propylcarbamoyl]-3-methyl-butyl}-carbamic acid benzyl ester
TypeSmall organic molecule
Emp. Form.C25H40N4O5
Mol. Mass.476.6089
SMILESCC(C)C[C@H](NC(=O)OCc1ccccc1)C(=O)N[C@@H](C(C)C)C(=O)N[C@@H](CCCCN)C=O