Reaction Details
TargetNeuronal acetylcholine receptor subunit alpha-3/beta-4
LigandBDBM50006640
Substrate/Competitorn/a
Meas. Tech.ChEMBL_1708057 (CHEMBL4059290)
IC50 100000±n/a nM
Citation Crestey, FJensen, AASoerensen, CMagnus, CBAndreasen, JTPeters, GHJKristensen, JL Dual Nicotinic Acetylcholine Receptor ?4?2 Antagonists/?7 Agonists: Synthesis, Docking Studies, and Pharmacological Evaluation of Tetrahydroisoquinolines and Tetrahydroisoquinolinium Salts. J Med Chem61:1719-1729 (2018) 
 
Neuronal acetylcholine receptor subunit alpha-3/beta-4
Name:Neuronal acetylcholine receptor subunit alpha-3/beta-4
Type:Protein
Mol. Mass.:n/a
Description:n/a
Components:This complex has 2 components.
Component 1
Name:Neuronal acetylcholine receptor subunit alpha-3
Synonyms:ACHA3_RAT Chrna3
Type:Enzyme
Mol. Mass.:56995.52
Organism:Rattus norvegicus (Rat)
Description:P04757
Residue:499
Component 2
Name:Neuronal acetylcholine receptor subunit beta-4
Synonyms:ACHB4_RAT Chrnb4 Neuronal acetylcholine receptor non-alpha-2 chain | Neuronal acetylcholine receptor protein beta-4 subunit
Type:Enzyme
Mol. Mass.:55863.89
Organism:Rattus norvegicus (Rat)
Description:P12392
Residue:495
BDBM50006640
NameBDBM50006640
Synonyms:CHEMBL593001
TypeSmall organic molecule
Emp. Form.C11H15NO2
Mol. Mass.193.2423
SMILESCOc1cc2CCN(C)Cc2cc1O