Reaction Details
TargetcAMP-specific 3',5'-cyclic phosphodiesterase 7B
LigandBDBM50272569
Substrate/Competitorn/a
Meas. Tech.ChEMBL_1712423 (CHEMBL4122472)
IC50 41±n/a nM
Citation Humphrey, JMMovsesian, MAm Ende, CWBecker, SLChappie, TAJenkinson, SLiras, JLLiras, SOrozco, CPandit, JVajdos, FFVandeput, FYang, EMenniti, FS Discovery of Potent and Selective Periphery-Restricted Quinazoline Inhibitors of the Cyclic Nucleotide Phosphodiesterase PDE1. J Med Chem61:4635-4640 (2018) 
 
cAMP-specific 3',5'-cyclic phosphodiesterase 7B
Name:cAMP-specific 3',5'-cyclic phosphodiesterase 7B
Type:Enzyme
Mol. Mass.:51842.76
Organism:Homo sapiens (Human)
Description:Q9NP56
Residue:450
BDBM50272569
NameBDBM50272569
Synonyms:CHEMBL4128481
TypeSmall organic molecule
Emp. Form.C17H21N5O2
Mol. Mass.327.3809
SMILESCOc1ccc2c(N[C@@H](C)Cc3cc(C)[nH]n3)ncnc2c1OC